{"text_format":"1","workbook":"xlsx","n_sheets":6,"sheets":["Contact Center","Result","Result2","Ordering Information","Reference for Server Selection","Revision History"],"not_rendered":{"charts":0,"images":0,"macros":1,"external_links":0,"defined_names":115,"comments":1,"pivot_tables":0},"unopened":[],"bounds":{"document_bytes":16777216,"sheet_cells":100000,"rows_first":2000,"rows_last":500,"rows_between":2000,"halvings":0,"cell_chars":16384,"cell_head_chars":4096},"cells_cut":0,"cells_raw":0,"read":"whole","date_system":"1900"}

{"sheet":"Contact Center","index":0,"n_rows":182,"n_cols":15,"rows_kept":182,"cut":false,"hidden":false,"merged":[[91,6,94,6],[166,6,179,6],[149,6,151,6],[95,6,108,6],[109,5,123,5],[162,5,179,5],[149,5,161,5],[162,6,165,6],[180,6,180,9],[127,6,131,6],[124,5,148,5],[181,6,181,9],[109,6,118,6],[119,6,123,6],[124,6,126,6],[132,6,147,6],[153,6,154,6],[158,6,160,6],[82,6,83,6],[87,6,89,6],[2,1,7,3],[1,1,1,11],[5,10,5,11],[78,6,80,6],[61,6,76,6],[56,6,60,6],[6,6,9,6],[10,6,13,6],[14,6,17,6],[18,6,21,6],[22,6,25,6],[26,6,29,6],[30,6,33,6],[0,12,0,13],[48,6,52,6],[38,6,47,6],[34,6,37,6],[53,6,55,6]]}
[null,null,null,null,null,null,null,null,null,null,null,null,"Hide"]
[null,"iPECS Contact Center Configuration"]
[null,"1. Fill in your company and customer information that will be displayed in the print form.\n2. Fill in customer requirements below.\n3. Input Config No and Comment.\n4. Generate the Configuration by clicking the \"Generate Print Form\" button and print out.\n5. Save the final configuration by clicking the \"Save Print Form As PDF File\" button or \"Save As File\" button."]
[]
[]
[null,null,null,null,null,null,"Category","Model Name","Unit Price","Quantity","Amount"]
[null,null,null,null,null,null,{"$f":"'Ordering Information'!B16","v":"System License\n(UCP100)"},{"$f":"'Ordering Information'!C16","v":"UCP100-CC-TS4"},{"$f":"'Ordering Information'!H16","v":0},{"$f":"IF(AND(CCS_System=\"iPECS UCP100\", CC_TS4),1,0)","v":0},{"$f":"I7*J7","v":0},{"$f":"Currency","v":"USD"},{"$f":"IF(CCS_System=\"iPECS UCP100\",199,IF(CCS_System=\"iPECS UCP600\",600,IF(OR(CCS_System=\"iPECS UCP2400\",CCS_System=\"iPECS vUCP\"),2400,IF(OR(CCS_System=\"iPECS eMG80\",CCS_System=\"iPECS eMG100\"),140,IF(CCS_System=\"iPECS eMG800\",1200,60000)))))","v":199}]
[null,null,null,null,null,null,null,{"$f":"'Ordering Information'!C17","v":"UCP100-3SIPEXT"},{"$f":"'Ordering Information'!H17","v":1},{"$f":"IF(CCS_System=\"iPECS UCP100\",AddedHMP,0)","v":0},{"$f":"I8*J8","v":0},"USD",{"$f":"IF(CCS_System=\"iPECS UCM\",LMEMaxAgent,IF(AvailAgent>MaxAgent, MaxAgent,AvailAgent))","v":199}]
[null,null,null,null,null,null,null,{"$f":"'Ordering Information'!C18","v":"UCP100-IPCRS"},{"$f":"'Ordering Information'!H18","v":1},{"$f":"IF(AND(CCS_System=\"iPECS UCP100\",IPCRC>0),1,0)","v":0},{"$f":"I9*J9","v":0},"USD"]
[null,"■ Enter your company information (below 4 lines)",null,null,null,null,null,{"$f":"'Ordering Information'!C19","v":"UCP100-IPCRC"},{"$f":"'Ordering Information'!H19","v":1},{"$f":"IF(CCS_System=\"iPECS UCP100\",IPCRC,0)","v":0},0,"USD"]
[null,"Your Company Name",null,null,null,null,{"$f":"'Ordering Information'!B20","v":"System License\n(UCP600)"},{"$f":"'Ordering Information'!C20","v":"UCP600-CC-TS4"},{"$f":"'Ordering Information'!H20","v":0},{"$f":"IF(AND(CCS_System=\"iPECS UCP600\", CC_TS4),1,0)","v":0},0,"USD",{"$f":"IF(CCS_System=\"iPECS UCP100\",199,IF(CCS_System=\"iPECS UCP600\",600,IF(OR(CCS_System=\"iPECS UCP2400\",CCS_System=\"iPECS vUCP\"),998,IF(OR(CCS_System=\"iPECS eMG80\",CCS_System=\"iPECS eMG100\"),30,IF(CCS_System=\"iPECS eMG800\",600)))))","v":199}]
[null,"Address 1",null,null,null,null,null,{"$f":"'Ordering Information'!C21","v":"UCP600-3SIPEXT"},{"$f":"'Ordering Information'!H21","v":1},{"$f":"IF(CCS_System=\"iPECS UCP600\",AddedHMP,0)","v":0},0,"USD",{"$f":"IF(AvailPRI>MaxAvailPRI, MaxAvailPRI, AvailPRI)","v":30},30]
[null,"Address 2",null,null,null,null,null,{"$f":"'Ordering Information'!C22","v":"UCP600-IPCRS"},{"$f":"'Ordering Information'!H22","v":1},{"$f":"IF(AND(CCS_System=\"iPECS UCP600\",IPCRC>0),1,0)","v":0},{"$f":"I13*J13","v":0},"USD"]
[null,"Tel. Number",null,null,null,null,null,{"$f":"'Ordering Information'!C23","v":"UCP600-IPCRC"},{"$f":"'Ordering Information'!H23","v":1},{"$f":"IF(CCS_System=\"iPECS UCP600\",IPCRC,0)","v":0},0,"USD"]
[null,"■ Enter your customer information (below 4 lines)",null,null,null,null,{"$f":"'Ordering Information'!B24","v":"System License\n(UCP2400)"},{"$f":"'Ordering Information'!C24","v":"UCP2400-CC-TS4"},{"$f":"'Ordering Information'!H24","v":0},{"$f":"IF(AND(CCS_System=\"iPECS UCP2400\", CC_TS4),1,0)","v":0},0,"USD",{"$f":"IF(CCS_System=\"iPECS UCP100\",199,IF(CCS_System=\"iPECS UCP600\",600,IF(OR(CCS_System=\"iPECS UCP2400\",CCS_System=\"iPECS vUCP\"),998,IF(OR(CCS_System=\"iPECS eMG80\",CCS_System=\"iPECS eMG100\"),16,IF(CCS_System=\"iPECS eMG800\",600)))))","v":199},{"$f":"COUNTIF(N39:N48,1)","v":0}]
[null,"Your Customer Name",null,null,null,null,null,{"$f":"'Ordering Information'!C25","v":"UCP2400-3SIPEXT"},{"$f":"'Ordering Information'!H25","v":1},{"$f":"IF(CCS_System=\"iPECS UCP2400\",AddedHMP,0)","v":0},0,"USD",{"$f":"IF(AvailSIP>240,240,AvailSIP)","v":199},0]
[null,"Address 1",null,null,null,null,null,{"$f":"'Ordering Information'!C26","v":"UCP2400-IPCRS"},{"$f":"'Ordering Information'!H26","v":1},{"$f":"IF(AND(CCS_System=\"iPECS UCP2400\",IPCRC>0),1,0)","v":0},{"$f":"I17*J17","v":0},"USD"]
[null,"Address 2",null,null,null,null,null,{"$f":"'Ordering Information'!C27","v":"UCP2400-IPCRC"},{"$f":"'Ordering Information'!H27","v":1},{"$f":"IF(CCS_System=\"iPECS UCP2400\",IPCRC,0)","v":0},0,"USD"]
[null,"Tel. Number",null,null,null,null,{"$f":"'Ordering Information'!B28","v":"System License\n(vUCP)"},{"$f":"'Ordering Information'!C28","v":"vUCP-CC-TS4"},{"$f":"'Ordering Information'!H28","v":0},{"$f":"IF(AND(CCS_System=\"iPECS vUCP\", CC_TS4),1,0)","v":0},0,"USD",{"$f":"IF(CCS_System=\"iPECS UCM\",75,IF(RealAvailSIP>50,50,RealAvailSIP))","v":50},64,50]
[null,null,null,null,null,null,null,{"$f":"'Ordering Information'!C29","v":"vUCP-3SIPEXT"},{"$f":"'Ordering Information'!H29","v":1},{"$f":"IF(CCS_System=\"iPECS vUCP\",AddedHMP,0)","v":0},0,"USD",{"$f":"IF(CCS_System=\"iPECS eMG80\", 8, 12)","v":12},50,64]
{"$rows_left_out":163}
{"sheet":"Result","index":1,"n_rows":341,"n_cols":6,"rows_kept":341,"cut":false,"hidden":false,"merged":[[330,3,330,4],[331,3,331,4],[333,3,333,4]]}
[]
[null,{"$f":"IF('Contact Center'!B11=0,\"\",'Contact Center'!B11)","v":"Your Company Name"}]
[null,{"$f":"IF('Contact Center'!B12=0,\"\",'Contact Center'!B12)","v":"Address 1"},null,null,"Config. No :",{"$f":"IF(ConfigNo=0,\"\",ConfigNo)","v":""}]
[null,{"$f":"IF('Contact Center'!B13=0,\"\",'Contact Center'!B13)","v":"Address 2"},null,null,"Date :",{"$f":"TODAY()","v":"2021-03-29"}]
[null,{"$f":"IF('Contact Center'!B14=0,\"\",'Contact Center'!B14)","v":"Tel. Number"}]
[]
[null,null,{"$f":"IF('Contact Center'!B16=0,\"\",'Contact Center'!B16)","v":"Your Customer Name"}]
[null,null,{"$f":"IF('Contact Center'!B17=0,\"\",'Contact Center'!B17)","v":"Address 1"}]
[null,null,{"$f":"IF('Contact Center'!B18=0,\"\",'Contact Center'!B18)","v":"Address 2"}]
[null,null,{"$f":"IF('Contact Center'!B19=0,\"\",'Contact Center'!B19)","v":"Tel. Number"}]
[]
[null,"iPECS CCX"]
[null,"Model Name","Description","Quantity","Price","Total"]
[null,{"$f":"'Ordering Information'!C16","v":"UCP100-CC-TS4"},{"$f":"'Ordering Information'!E16","v":"TAPI and 4 SIP Extension license for CCX in UCP100"},{"$f":"IF(MaintOnlyPrint=0,'Contact Center'!J7,0)","v":0},{"$f":"'Ordering Information'!I16","v":0},{"$f":"D14*E14","v":0}]
[null,{"$f":"'Ordering Information'!C17","v":"UCP100-3SIPEXT"},{"$f":"'Ordering Information'!E17","v":"Additional SIP Extension License for Announcement Channel in UCP100"},{"$f":"IF(MaintOnlyPrint=0,'Contact Center'!J8,0)","v":0},{"$f":"'Ordering Information'!I17","v":1},{"$f":"D15*E15","v":0}]
[null,{"$f":"'Ordering Information'!C18","v":"UCP100-IPCRS"},{"$f":"'Ordering Information'!E18","v":"IP Call Recording Server License for UCP100 (per IPCR Server)"},{"$f":"IF(MaintOnlyPrint=0,'Contact Center'!J9,0)","v":0},{"$f":"'Ordering Information'!I18","v":1},{"$f":"D16*E16","v":0}]
[null,{"$f":"'Ordering Information'!C19","v":"UCP100-IPCRC"},{"$f":"'Ordering Information'!E19","v":"IP Call Recording Agent License for UCP100 (per IPCR Agent)"},{"$f":"IF(MaintOnlyPrint=0,'Contact Center'!J10,0)","v":0},{"$f":"'Ordering Information'!I19","v":1},0]
[null,{"$f":"'Ordering Information'!C20","v":"UCP600-CC-TS4"},{"$f":"'Ordering Information'!E20","v":"TAPI and 4 SIP Extension license for CCX in UCP600"},{"$f":"IF(MaintOnlyPrint=0,'Contact Center'!J11,0)","v":0},{"$f":"'Ordering Information'!I20","v":0},{"$f":"D18*E18","v":0}]
[null,{"$f":"'Ordering Information'!C21","v":"UCP600-3SIPEXT"},{"$f":"'Ordering Information'!E21","v":"Additional SIP Extension License for Announcement Channel in UCP600"},{"$f":"IF(MaintOnlyPrint=0,'Contact Center'!J12,0)","v":0},{"$f":"'Ordering Information'!I21","v":1},0]
[null,{"$f":"'Ordering Information'!C22","v":"UCP600-IPCRS"},{"$f":"'Ordering Information'!E22","v":"IP Call Recording Server License for UCP600 (per IPCR Server)"},{"$f":"IF(MaintOnlyPrint=0,'Contact Center'!J13,0)","v":0},{"$f":"'Ordering Information'!I22","v":1},{"$f":"D20*E20","v":0}]
{"$rows_left_out":322}
{"sheet":"Result2","index":2,"n_rows":341,"n_cols":7,"rows_kept":341,"cut":false,"hidden":false,"merged":[[330,4,330,5],[331,4,331,5],[333,4,333,5]]}
[]
[null,{"$f":"IF('Contact Center'!B11=0,\"\",'Contact Center'!B11)","v":"Your Company Name"}]
[null,{"$f":"IF('Contact Center'!B12=0,\"\",'Contact Center'!B12)","v":"Address 1"},null,null,null,"Config. No :",{"$f":"IF(ConfigNo=0,\"\",ConfigNo)","v":""}]
[null,{"$f":"IF('Contact Center'!B13=0,\"\",'Contact Center'!B13)","v":"Address 2"},null,null,null,"Date :",{"$f":"TODAY()","v":"2021-03-29"}]
[null,{"$f":"IF('Contact Center'!B14=0,\"\",'Contact Center'!B14)","v":"Tel. Number"}]
[]
[null,null,null,{"$f":"IF('Contact Center'!B16=0,\"\",'Contact Center'!B16)","v":"Your Customer Name"}]
[null,null,null,{"$f":"IF('Contact Center'!B17=0,\"\",'Contact Center'!B17)","v":"Address 1"}]
[null,null,null,{"$f":"IF('Contact Center'!B18=0,\"\",'Contact Center'!B18)","v":"Address 2"}]
[null,null,null,{"$f":"IF('Contact Center'!B19=0,\"\",'Contact Center'!B19)","v":"Tel. Number"}]
[]
[null,"iPECS CCX"]
[null,"Model Name","Part Number","Description","Quantity","Price","Total"]
[null,{"$f":"'Ordering Information'!C16","v":"UCP100-CC-TS4"},{"$f":"'Ordering Information'!D16","v":"TSWA9092201"},{"$f":"'Ordering Information'!E16","v":"TAPI and 4 SIP Extension license for CCX in UCP100"},{"$f":"IF(MaintOnlyPrint=0,'Contact Center'!J7,0)","v":0},{"$f":"'Ordering Information'!I16","v":0},{"$f":"E14*F14","v":0}]
[null,{"$f":"'Ordering Information'!C17","v":"UCP100-3SIPEXT"},{"$f":"'Ordering Information'!D17","v":"TSWA9087501"},{"$f":"'Ordering Information'!E17","v":"Additional SIP Extension License for Announcement Channel in UCP100"},{"$f":"IF(MaintOnlyPrint=0,'Contact Center'!J8,0)","v":0},{"$f":"'Ordering Information'!I17","v":1},{"$f":"E15*F15","v":0}]
[null,{"$f":"'Ordering Information'!C18","v":"UCP100-IPCRS"},{"$f":"'Ordering Information'!D18","v":"TSWA9091601"},{"$f":"'Ordering Information'!E18","v":"IP Call Recording Server License for UCP100 (per IPCR Server)"},{"$f":"IF(MaintOnlyPrint=0,'Contact Center'!J9,0)","v":0},{"$f":"'Ordering Information'!I18","v":1},{"$f":"E16*F16","v":0}]
[null,{"$f":"'Ordering Information'!C19","v":"UCP100-IPCRC"},{"$f":"'Ordering Information'!D19","v":"TSWA9091701"},{"$f":"'Ordering Information'!E19","v":"IP Call Recording Agent License for UCP100 (per IPCR Agent)"},{"$f":"IF(MaintOnlyPrint=0,'Contact Center'!J10,0)","v":0},{"$f":"'Ordering Information'!I19","v":1},0]
[null,{"$f":"'Ordering Information'!C20","v":"UCP600-CC-TS4"},{"$f":"'Ordering Information'!D20","v":"TSWA9097101"},{"$f":"'Ordering Information'!E20","v":"TAPI and 4 SIP Extension license for CCX in UCP600"},{"$f":"IF(MaintOnlyPrint=0,'Contact Center'!J11,0)","v":0},{"$f":"'Ordering Information'!I20","v":0},{"$f":"E18*F18","v":0}]
[null,{"$f":"'Ordering Information'!C21","v":"UCP600-3SIPEXT"},{"$f":"'Ordering Information'!D21","v":"TSWA9094001"},{"$f":"'Ordering Information'!E21","v":"Additional SIP Extension License for Announcement Channel in UCP600"},{"$f":"IF(MaintOnlyPrint=0,'Contact Center'!J12,0)","v":0},{"$f":"'Ordering Information'!I21","v":1},0]
[null,{"$f":"'Ordering Information'!C22","v":"UCP600-IPCRS"},{"$f":"'Ordering Information'!D22","v":"TSWA9096801"},{"$f":"'Ordering Information'!E22","v":"IP Call Recording Server License for UCP600 (per IPCR Server)"},{"$f":"IF(MaintOnlyPrint=0,'Contact Center'!J13,0)","v":0},{"$f":"'Ordering Information'!I22","v":1},{"$f":"E20*F20","v":0}]
{"$rows_left_out":322}
{"sheet":"Ordering Information","index":3,"n_rows":367,"n_cols":9,"rows_kept":367,"cut":false,"hidden":false,"merged":[[15,1,18,1],[19,1,22,1],[23,1,26,1],[27,1,30,1],[35,1,38,1],[31,1,34,1],[353,1,366,1],[1,1,2,7],[189,1,192,1],[79,1,94,1],[100,1,101,1],[62,1,64,1],[185,1,187,1],[10,5,10,6],[11,5,11,6],[12,5,12,6],[113,1,126,1],[105,1,107,1],[47,1,56,1],[57,1,61,1],[96,1,98,1],[65,1,78,1],[287,1,296,1],[297,1,301,1],[273,1,286,1],[239,1,254,1],[260,1,261,1],[265,1,267,1],[269,1,272,1],[256,1,258,1],[349,1,352,1],[302,1,304,1],[319,1,334,1],[340,1,341,1],[345,1,347,1],[336,1,338,1],[305,1,318,1],[4,5,4,6],[6,5,6,6],[7,5,7,6],[8,5,8,6],[9,5,9,6],[39,1,42,1],[43,1,46,1],[225,1,238,1],[109,1,112,1],[180,1,181,1],[142,1,144,1],[159,1,174,1],[176,1,178,1],[222,1,224,1],[127,1,136,1],[207,1,216,1],[137,1,141,1],[217,1,221,1],[193,1,206,1],[145,1,158,1]]}
[null,null,null,null,null,null,null,null,"Hide"]
[null,"iPECS CCX Price Table"]
[]
[]
[null,null,null,null,null,"Access Password"]
[]
[null,null,null,null,null,"VAT",null,0]
[null,null,null,null,null,"Base Markup",null,0]
[null,null,null,null,null,"Additional Cost",null,0]
[null,null,null,null,null,"Currency",null,"USD"]
[null,null,null,null,null,"Renewal Rate",null,0.1]
[null,null,null,null,null,"Renewal Discount",null,7.0000000000000007E-2]
[null,null,null,null,null,"Renewal after expiry",null,0.3]
[]
[null,"Category","Model Name","PDM code","Description","Unit Price","Markup Adjust","Amount"]
[null,"System License\n(UCP100)","UCP100-CC-TS4","TSWA9092201","TAPI and 4 SIP Extension license for CCX in UCP100",0,0,{"$f":"I16*(1+VAT)","v":0},{"$f":"F16*(1+AddCost)+(F16*(1+AddCost)*(BaseMarkup+G16))","v":0}]
[null,null,"UCP100-3SIPEXT","TSWA9087501","Additional SIP Extension License for Announcement Channel in UCP100",1,0,1,1]
[null,null,"UCP100-IPCRS","TSWA9091601","IP Call Recording Server License for UCP100 (per IPCR Server)",1,0,{"$f":"I18*(1+VAT)","v":1},{"$f":"F18*(1+AddCost)+(F18*(1+AddCost)*(BaseMarkup+G18))","v":1}]
[null,null,"UCP100-IPCRC","TSWA9091701","IP Call Recording Agent License for UCP100 (per IPCR Agent)",1,0,1,1]
[null,"System License\n(UCP600)","UCP600-CC-TS4","TSWA9097101","TAPI and 4 SIP Extension license for CCX in UCP600",0,0,0,0]
{"$rows_left_out":348}
{"sheet":"Reference for Server Selection","index":4,"n_rows":23,"n_cols":5,"rows_kept":23,"cut":false,"hidden":false,"merged":[[18,2,18,3],[21,2,21,3],[20,2,20,3],[22,1,22,4],[1,1,1,4],[10,2,11,4],[15,1,15,3],[6,2,6,3],[7,2,7,4],[12,2,12,4]]}
[]
[null,"Reference Hardware Specification for CCX Server"]
[null,"Install Scope","Up to 30 CCX Agents\nwith 500 Calls Maximum\nPer Day","Up to 50 CCX Agents\nwith 1000 Calls Maximum\nPer Day","More than 50 CCX Agents\nwith more than 1000 Calls\nPer Day"]
[null,"Dedicated Server Required","Yes","Yes","Yes"]
[null,"SQL Express / Full Version","SQL Express","Full Version","Full Version"]
[null,"Virtual Server Possible","Yes","Yes","Yes"]
[null,"Operating System","Windows Server 2012 R2\nWindows Server 2016\nWindows Server 2019\nWindows 10 Professional",null,"Windows Server 2012 R2\nWindows Server 2016\nWindows Server 2019"]
[null,"CPU","I5 3.3GHz 64bit"]
[null,"RAM ","4 GB","6 GB","8 GB"]
[null,"Available Disk Space\n(with CCX Record)","1 TB","1 TB","3 TB"]
[null,"USB Slot","Depends on CCX Record license.\nStatic IP and MAC Address on Network card required for Licensing and\nPBX Connection. Wifi not recommended"]
[null,"Network Card"]
[null,"Additional Requirements","PBX TAPI driver must be installed.\nCaller ID must be enabled on the trunk lines."]
[null,"* NOTE : If you need to install CCX Record server separately, you should contact CCX Care for the recommended hardware specification for CCX Record server."]
[]
[null,"Reference Hardware Specification for CCX Client"]
[null,"Install Scope","Client","Client and Manager"]
[null,"Operating System","Windows 10 Professional\nWindows 8.1\nWindows 7","Windows 10 Professional\nWindows 8.1\nWindows 7"]
[null,"CPU","I3 3.3GHz"]
[null,"RAM ","2 GB","4 GB"]
{"$rows_left_out":4}
{"sheet":"Revision History","index":5,"n_rows":15,"n_cols":4,"rows_kept":15,"cut":false,"hidden":false,"merged":[]}
[]
[null,"Revision History"]
[]
[null,"Date","Version","Note"]
[null,"2019-06-30","1.0",". Initial Release"]
[null,"2019-12-05","1.1",". Official Release"]
[null,"2019-12-05","1.2",". Price items desription correction\n. Call Server option added - eMG100 & UCM\n. Twitter removed from SNS query"]
[null,"2020-01-21","1.3",". Official Release"]
[null,"2020-02-11","1.4",". CCX-PAC description fixed : 2 CCX Report Plus - Dashboard & User License"]
[null,"2020-02-11","1.5",". CCX-PAC description fixed : 2 CCX Report Plus - Dashboard & User License"]
[null,"2020-10-14","1.6",". PDM code updated"]
[null,"2021-01-12","1.7",". UCM supports only IPCR for call recording, not CCX Record.\n. System configuration for IPCR is added, just for your reference. IPCR must be configured in system configuration separately."]
[null,"2021-01-18","1.8",". CX-IPCR-INT-ADD model name fixed"]
[null,"2021-03-15","1.9",". CCX-PAC maintenance required 4 HMP maintenance separately."]
[null,"2021-03-29","1.10",". Description for UCP100-IPCRC & UCP600-IPCRC fixed."]